Country,Age,Sex,Sex_4_TEXT,CountryOfResidence,CountryOfResidence_10_TEXT,MaritalStatus,MaritalStatus_7_TEXT,AreYouStudent,UniversityF_PTime,UniversityF_PTime_4_TEXT,UniversityName,UniversitySubject,UniversitySubject_14_TEXT,DegreeClassification,DegreeClassification_5_TEXT,Employed,Employed_5_TEXT,EmploymentCOVID19,EmploymentCOVID19_4_TEXT,TechDeviceAtHome_1,TechDeviceAtHome_2,TechDeviceAtHome_3,TechDeviceAtHome_4,TechDeviceAtHome_5,TechDeviceAtHome_5_TEXT,TechDeviceOnwership_1,TechDeviceOnwership_2,TechDeviceOnwership_3,TechDeviceOnwership_4,TechDeviceOnwership_5,TechDeviceOnwership_5_TEXT,ReliableInternetAcce_1,PersonalSpaceTech,UsageBeforeCOVID,UsageDuringCovid,PeopleInHousehold,HADS_Q1,HADS_Q2,HADS_Q3,HADS_Q4,HADS_Q5,HADS_Q6,HADS_Q7,HADS_Q8,HADS_Q9,HADS_Q10,HADS_Q11,HADS_Q12,HADS_Q13,HADS_Q14,COPE1,COPE2,COPE3,COPE4,COPE5,COPE6,COPE7,COPE8,COPE9,COPE10,COPE11,COPE12,COPE13,COPE14,COPE15,COPE16,COPE17,COPE18,COPE19,COPE20,COPE21,COPE22,COPE23,COPE24,COPE25,COPE26,COPE27,COPE28,COPE29,COPE30,COPE31,COPE32,COPE33,COPE34,COPE35,COPE36,COPE37,COPE38,COPE39,COPE40,COPE41,COPE42,COPE43,COPE44,COPE45,COPE46,COPE47,COPE48,COPE49,COPE50,COPE51,COPE52,COPE53,COPE54,COPE55,COPE56,COPE57,COPE58,COPE59,COPE60,TS1_6_1,TS1_6_2,TS1_6_3,TS1_6_4,TS1_6_5,TS1_6_6,TS7_12_1,TS7_12_2,TS7_12_3,TS7_12_4,TS7_12_5,TS7_12_6,TS13_17_1,TS13_17_2,TS13_17_3,TS13_17_4,TS13_17_5,TS18_21_1,TS18_21_2,TS18_21_3,TS18_21_4,TotalTS,Techno_Overload,WHConf,Techno_Complexity,Techno_Reliabity,Techno_Sociality,Pace_Of_Change,Techno_Strain,PosReinterGrowth,MentalDisengagement,FocusOnAndVentEmotions,InstrumentalSocSupport,ActiveCoping,Denial,ReligiousCoping,Humour,BehaviouralDisengagement,Restraint,UseOfEmotionalSupport,SubstanceUse,Acceptance,SuppressionOfCompetingActivities,Planning,PFCoping,AvCoping,EFCoping,Anxiety,Depress
1.0,30.0,1.0,,7.0,,8.0,,2.0,,,,,,,,1.0,,,,1.0,0.0,1.0,1.0,,,1.0,0.0,0.0,1.0,,,6.0,2.0,11.0,16.0,6.0,2.0,1.0,1.0,2.0,3.0,2.0,1.0,1.0,2.0,1.0,0.0,1.0,2.0,1.0,4.0,4.0,4.0,4.0,4.0,4.0,4.0,4.0,4.0,4.0,4.0,4.0,4.0,4.0,4.0,4.0,4.0,4.0,4.0,4.0,4.0,4.0,4.0,4.0,4.0,4.0,4.0,4.0,4.0,4.0,4.0,4.0,4.0,4.0,4.0,4.0,4.0,4.0,4.0,4.0,4.0,4.0,4.0,4.0,4.0,4.0,4.0,4.0,4.0,4.0,4.0,4.0,4.0,4.0,4.0,4.0,4.0,4.0,4.0,4.0,7.0,7.0,7.0,7.0,7.0,7.0,3.0,3.0,3.0,4.0,4.0,3.0,7.0,7.0,7.0,7.0,7.0,7.0,7.0,7.0,7.0,121.0,21.0,21.0,9.0,11.0,14.0,21.0,28.0,16.0,16.0,16.0,16.0,16.0,16.0,16.0,16.0,16.0,16.0,16.0,16.0,16.0,16.0,16.0,96.0,80.0,48.0,13.0,7.0
1.0,27.0,1.0,,7.0,,8.0,,1.0,2.0,,Federico II,14.0,Social Service,1.0,,1.0,,,,1.0,0.0,0.0,1.0,,,1.0,0.0,0.0,1.0,,,5.0,1.0,3.0,8.0,3.0,1.0,2.0,0.0,1.0,0.0,0.0,1.0,1.0,1.0,0.0,0.0,1.0,1.0,0.0,3.0,3.0,2.0,2.0,3.0,1.0,2.0,1.0,1.0,3.0,3.0,1.0,3.0,3.0,1.0,2.0,2.0,2.0,3.0,2.0,3.0,4.0,3.0,1.0,3.0,1.0,1.0,2.0,3.0,3.0,2.0,3.0,2.0,2.0,1.0,1.0,1.0,3.0,3.0,1.0,4.0,3.0,2.0,3.0,2.0,2.0,3.0,2.0,4.0,1.0,1.0,3.0,1.0,3.0,2.0,3.0,1.0,3.0,3.0,2.0,2.0,3.0,2.0,2.0,1.0,4.0,6.0,6.0,5.0,5.0,5.0,4.0,7.0,7.0,6.0,5.0,5.0,4.0,4.0,3.0,3.0,63.0,7.0,7.0,17.0,14.0,14.0,16.0,14.0,12.0,9.0,8.0,10.0,12.0,4.0,8.0,5.0,4.0,15.0,11.0,4.0,12.0,8.0,12.0,71.0,26.0,29.0,6.0,3.0
1.0,22.0,1.0,,7.0,,7.0,fidanzata,1.0,1.0,,Federico II,14.0,Social Service,1.0,,3.0,,,,1.0,0.0,1.0,1.0,,,1.0,0.0,0.0,1.0,,,6.0,1.0,4.0,7.0,5.0,2.0,1.0,0.0,3.0,2.0,2.0,2.0,3.0,2.0,0.0,1.0,1.0,1.0,0.0,3.0,2.0,4.0,2.0,3.0,2.0,2.0,1.0,1.0,2.0,3.0,1.0,3.0,4.0,1.0,2.0,2.0,2.0,2.0,,1.0,1.0,3.0,1.0,4.0,1.0,1.0,4.0,4.0,4.0,2.0,4.0,1.0,2.0,1.0,1.0,1.0,4.0,4.0,1.0,3.0,2.0,2.0,4.0,1.0,4.0,1.0,2.0,3.0,1.0,1.0,4.0,1.0,4.0,1.0,4.0,1.0,4.0,4.0,2.0,4.0,1.0,5.0,1.0,1.0,1.0,4.0,4.0,4.0,2.0,4.0,4.0,7.0,7.0,3.0,3.0,3.0,2.0,4.0,4.0,2.0,62.0,10.0,3.0,12.0,10.0,14.0,9.0,12.0,15.0,8.0,14.0,11.0,12.0,5.0,8.0,3.0,4.0,9.0,12.0,4.0,12.0,5.0,14.0,67.0,24.0,37.0,14.0,6.0
1.0,21.0,1.0,,7.0,,1.0,,1.0,1.0,,Federico II,14.0,Social Service,1.0,,4.0,,,,1.0,0.0,1.0,1.0,,,0.0,0.0,1.0,1.0,,,6.0,2.0,3.0,8.0,4.0,3.0,2.0,0.0,3.0,3.0,2.0,3.0,2.0,3.0,0.0,1.0,3.0,1.0,0.0,2.0,2.0,3.0,4.0,1.0,2.0,3.0,2.0,2.0,4.0,4.0,1.0,2.0,4.0,2.0,2.0,4.0,3.0,1.0,2.0,2.0,4.0,4.0,3.0,1.0,1.0,2.0,3.0,3.0,2.0,4.0,2.0,2.0,4.0,1.0,2.0,2.0,2.0,2.0,2.0,3.0,3.0,4.0,2.0,4.0,3.0,1.0,3.0,3.0,2.0,2.0,4.0,1.0,1.0,2.0,3.0,2.0,3.0,2.0,3.0,2.0,1.0,6.0,7.0,4.0,6.0,1.0,3.0,3.0,4.0,5.0,4.0,5.0,5.0,4.0,4.0,4.0,4.0,4.0,5.0,5.0,90.0,9.0,17.0,7.0,13.0,10.0,12.0,18.0,9.0,12.0,13.0,14.0,6.0,8.0,12.0,8.0,9.0,14.0,16.0,4.0,7.0,9.0,8.0,53.0,41.0,43.0,18.0,8.0
1.0,31.0,1.0,,7.0,,1.0,,1.0,2.0,,Federico II,14.0,Social Service,1.0,,1.0,,,,1.0,1.0,0.0,1.0,,,1.0,0.0,0.0,1.0,,,5.0,1.0,10.0,15.0,3.0,3.0,3.0,2.0,2.0,3.0,2.0,2.0,1.0,3.0,2.0,1.0,2.0,2.0,0.0,3.0,3.0,1.0,1.0,3.0,2.0,1.0,1.0,1.0,3.0,3.0,1.0,2.0,3.0,2.0,2.0,4.0,1.0,2.0,2.0,1.0,1.0,2.0,1.0,3.0,1.0,2.0,1.0,2.0,2.0,1.0,2.0,2.0,1.0,1.0,1.0,2.0,2.0,3.0,1.0,1.0,1.0,1.0,3.0,3.0,3.0,1.0,1.0,2.0,1.0,1.0,2.0,1.0,3.0,1.0,1.0,2.0,2.0,3.0,1.0,4.0,4.0,4.0,7.0,5.0,7.0,4.0,4.0,4.0,4.0,4.0,4.0,7.0,7.0,5.0,5.0,5.0,7.0,7.0,7.0,7.0,100.0,12.0,19.0,12.0,12.0,14.0,15.0,28.0,10.0,7.0,9.0,9.0,9.0,7.0,4.0,5.0,5.0,7.0,8.0,4.0,9.0,6.0,8.0,49.0,28.0,26.0,16.0,12.0
1.0,22.0,1.0,,7.0,,1.0,,1.0,1.0,,Federico II,14.0,Social Service,1.0,,3.0,,,,0.0,0.0,1.0,1.0,,,0.0,0.0,0.0,1.0,,,5.0,1.0,2.0,5.0,2.0,2.0,1.0,1.0,3.0,1.0,2.0,1.0,2.0,2.0,2.0,0.0,2.0,1.0,1.0,4.0,2.0,2.0,2.0,2.0,2.0,1.0,3.0,1.0,2.0,2.0,1.0,3.0,3.0,1.0,2.0,3.0,1.0,1.0,3.0,2.0,1.0,4.0,1.0,3.0,1.0,1.0,2.0,4.0,2.0,1.0,1.0,1.0,2.0,1.0,3.0,1.0,4.0,2.0,1.0,1.0,3.0,1.0,3.0,2.0,2.0,1.0,4.0,1.0,3.0,2.0,2.0,1.0,3.0,1.0,1.0,1.0,2.0,3.0,4.0,5.0,6.0,5.0,5.0,3.0,3.0,2.0,2.0,6.0,6.0,6.0,5.0,7.0,6.0,7.0,3.0,6.0,6.0,6.0,7.0,6.0,92.0,16.0,11.0,10.0,17.0,13.0,16.0,25.0,15.0,6.0,9.0,9.0,8.0,5.0,10.0,12.0,5.0,5.0,10.0,4.0,11.0,6.0,5.0,50.0,32.0,28.0,13.0,8.0
1.0,26.0,1.0,,7.0,,7.0,Fidanzata,2.0,,,,,,,,2.0,,,,1.0,1.0,0.0,1.0,,,1.0,0.0,0.0,1.0,,,7.0,1.0,3.0,5.0,3.0,1.0,1.0,0.0,1.0,1.0,1.0,0.0,1.0,1.0,0.0,1.0,0.0,0.0,0.0,2.0,3.0,2.0,3.0,2.0,1.0,1.0,2.0,1.0,2.0,2.0,2.0,2.0,2.0,1.0,3.0,1.0,1.0,2.0,3.0,1.0,1.0,2.0,1.0,2.0,2.0,1.0,3.0,4.0,2.0,2.0,2.0,1.0,2.0,2.0,2.0,1.0,3.0,3.0,2.0,2.0,1.0,3.0,4.0,3.0,1.0,2.0,1.0,2.0,2.0,1.0,2.0,1.0,3.0,1.0,1.0,1.0,3.0,3.0,2.0,3.0,2.0,1.0,5.0,2.0,2.0,6.0,6.0,5.0,5.0,5.0,5.0,5.0,6.0,5.0,6.0,6.0,3.0,2.0,4.0,3.0,65.0,6.0,9.0,17.0,15.0,11.0,17.0,12.0,12.0,11.0,7.0,10.0,9.0,5.0,5.0,9.0,4.0,7.0,8.0,7.0,10.0,4.0,8.0,50.0,36.0,25.0,5.0,3.0
1.0,24.0,1.0,,7.0,,1.0,,1.0,3.0,,Federico II,14.0,Social Service,1.0,,4.0,,,,1.0,0.0,0.0,1.0,,,1.0,0.0,0.0,1.0,,,5.0,1.0,8.0,9.0,1.0,2.0,3.0,1.0,2.0,2.0,2.0,1.0,3.0,2.0,2.0,1.0,2.0,2.0,2.0,2.0,4.0,2.0,2.0,4.0,1.0,2.0,4.0,3.0,2.0,2.0,3.0,4.0,2.0,3.0,4.0,2.0,2.0,1.0,4.0,1.0,2.0,4.0,1.0,3.0,1.0,1.0,1.0,3.0,2.0,2.0,2.0,1.0,2.0,1.0,3.0,1.0,3.0,4.0,1.0,4.0,2.0,1.0,4.0,2.0,2.0,1.0,2.0,3.0,4.0,1.0,2.0,1.0,3.0,2.0,3.0,3.0,2.0,4.0,2.0,2.0,2.0,1.0,4.0,2.0,1.0,3.0,4.0,5.0,6.0,3.0,5.0,7.0,7.0,6.0,6.0,6.0,3.0,5.0,2.0,2.0,66.0,5.0,7.0,12.0,14.0,14.0,18.0,12.0,12.0,11.0,7.0,8.0,10.0,6.0,8.0,15.0,6.0,11.0,10.0,6.0,12.0,8.0,10.0,63.0,44.0,25.0,15.0,12.0
1.0,26.0,1.0,,7.0,,1.0,,1.0,2.0,,Federico II,14.0,,1.0,,2.0,,,,1.0,0.0,0.0,1.0,,,0.0,0.0,0.0,1.0,,,3.0,1.0,2.0,5.0,3.0,3.0,2.0,2.0,2.0,3.0,2.0,1.0,1.0,2.0,0.0,1.0,2.0,2.0,0.0,2.0,4.0,4.0,3.0,2.0,2.0,1.0,1.0,2.0,3.0,4.0,1.0,2.0,3.0,1.0,3.0,2.0,1.0,2.0,1.0,2.0,2.0,4.0,2.0,3.0,1.0,2.0,4.0,2.0,3.0,4.0,2.0,1.0,4.0,1.0,1.0,2.0,2.0,2.0,2.0,3.0,2.0,1.0,2.0,2.0,3.0,2.0,1.0,2.0,2.0,2.0,4.0,1.0,2.0,2.0,2.0,2.0,2.0,2.0,1.0,4.0,3.0,5.0,6.0,4.0,6.0,6.0,5.0,2.0,2.0,2.0,2.0,4.0,5.0,4.0,4.0,4.0,3.0,5.0,6.0,3.0,93.0,12.0,16.0,13.0,6.0,9.0,12.0,17.0,8.0,12.0,13.0,11.0,9.0,8.0,4.0,5.0,8.0,10.0,16.0,4.0,8.0,6.0,8.0,49.0,37.0,40.0,15.0,8.0
1.0,21.0,1.0,,7.0,,7.0,fidanzata,1.0,2.0,,Federico II,14.0,Servizio Sociali,1.0,,4.0,,,,1.0,0.0,0.0,1.0,,,1.0,0.0,0.0,1.0,,,5.0,1.0,4.0,10.0,4.0,2.0,2.0,0.0,1.0,3.0,0.0,1.0,2.0,2.0,0.0,1.0,2.0,2.0,0.0,3.0,3.0,3.0,2.0,4.0,4.0,2.0,2.0,1.0,2.0,4.0,1.0,4.0,4.0,2.0,4.0,4.0,2.0,1.0,2.0,3.0,3.0,4.0,1.0,3.0,1.0,4.0,3.0,1.0,3.0,4.0,2.0,2.0,4.0,1.0,1.0,1.0,2.0,3.0,2.0,4.0,4.0,2.0,4.0,4.0,4.0,1.0,2.0,3.0,1.0,1.0,4.0,1.0,3.0,2.0,2.0,2.0,4.0,4.0,1.0,2.0,3.0,3.0,1.0,1.0,2.0,7.0,7.0,4.0,4.0,4.0,4.0,7.0,7.0,7.0,7.0,3.0,2.0,2.0,4.0,2.0,59.0,8.0,4.0,18.0,12.0,14.0,17.0,10.0,10.0,13.0,14.0,13.0,12.0,12.0,7.0,6.0,4.0,12.0,16.0,4.0,14.0,10.0,8.0,66.0,39.0,43.0,14.0,4.0
1.0,30.0,1.0,,7.0,,7.0,Fidanzata,1.0,1.0,,SUN,8.0,,2.0,,2.0,,,,1.0,0.0,0.0,1.0,,,1.0,0.0,0.0,1.0,,,4.0,1.0,4.0,5.0,1.0,1.0,1.0,0.0,1.0,2.0,2.0,1.0,1.0,1.0,0.0,1.0,1.0,1.0,0.0,2.0,3.0,2.0,2.0,2.0,1.0,2.0,2.0,1.0,2.0,2.0,1.0,2.0,2.0,1.0,2.0,3.0,1.0,3.0,3.0,2.0,1.0,3.0,1.0,2.0,2.0,1.0,2.0,2.0,3.0,1.0,3.0,2.0,2.0,1.0,1.0,1.0,2.0,2.0,1.0,2.0,2.0,3.0,2.0,3.0,1.0,2.0,1.0,2.0,2.0,1.0,2.0,1.0,3.0,3.0,2.0,1.0,2.0,2.0,1.0,4.0,5.0,3.0,2.0,1.0,1.0,7.0,7.0,6.0,4.0,4.0,4.0,5.0,5.0,4.0,4.0,4.0,1.0,1.0,2.0,2.0,56.0,12.0,4.0,20.0,12.0,10.0,12.0,6.0,8.0,9.0,8.0,10.0,8.0,4.0,5.0,8.0,4.0,7.0,9.0,5.0,9.0,8.0,10.0,50.0,30.0,27.0,8.0,5.0
1.0,38.0,2.0,,7.0,,1.0,,1.0,2.0,,Federico II,14.0,Social Service,1.0,,2.0,,,,1.0,1.0,1.0,1.0,1.0,smartwatch,1.0,1.0,1.0,1.0,1.0,smartwatch,6.0,1.0,6.0,9.0,4.0,3.0,2.0,0.0,1.0,1.0,1.0,1.0,1.0,2.0,0.0,1.0,1.0,1.0,0.0,3.0,4.0,3.0,3.0,2.0,1.0,1.0,2.0,1.0,2.0,4.0,1.0,1.0,4.0,1.0,3.0,3.0,1.0,2.0,2.0,1.0,1.0,4.0,1.0,1.0,1.0,1.0,4.0,3.0,4.0,2.0,3.0,2.0,3.0,1.0,1.0,1.0,2.0,3.0,1.0,2.0,3.0,4.0,3.0,4.0,3.0,3.0,1.0,1.0,1.0,1.0,4.0,1.0,3.0,2.0,3.0,1.0,3.0,4.0,1.0,1.0,1.0,1.0,1.0,1.0,4.0,7.0,7.0,7.0,5.0,7.0,7.0,7.0,7.0,5.0,4.0,4.0,1.0,1.0,1.0,1.0,36.0,3.0,6.0,21.0,19.0,14.0,13.0,4.0,12.0,13.0,13.0,15.0,9.0,4.0,4.0,6.0,4.0,6.0,15.0,4.0,8.0,8.0,11.0,54.0,31.0,43.0,10.0,5.0
1.0,21.0,1.0,,7.0,,1.0,,1.0,1.0,,Federico II,14.0,Social Service,1.0,,3.0,,,,0.0,0.0,0.0,1.0,,,0.0,0.0,0.0,1.0,,,3.0,1.0,6.0,10.0,4.0,1.0,2.0,0.0,0.0,0.0,0.0,0.0,1.0,0.0,0.0,1.0,0.0,0.0,0.0,4.0,2.0,2.0,2.0,4.0,2.0,1.0,1.0,1.0,3.0,2.0,1.0,2.0,2.0,1.0,2.0,2.0,1.0,2.0,2.0,2.0,3.0,3.0,1.0,2.0,1.0,1.0,3.0,4.0,3.0,2.0,3.0,3.0,3.0,1.0,1.0,1.0,3.0,4.0,1.0,3.0,3.0,2.0,4.0,3.0,1.0,1.0,1.0,3.0,1.0,1.0,3.0,1.0,3.0,1.0,2.0,1.0,4.0,4.0,1.0,2.0,1.0,1.0,1.0,1.0,5.0,5.0,5.0,4.0,3.0,5.0,4.0,7.0,7.0,2.0,1.0,1.0,3.0,5.0,5.0,3.0,55.0,4.0,7.0,14.0,12.0,14.0,4.0,16.0,15.0,8.0,8.0,10.0,11.0,5.0,4.0,5.0,4.0,12.0,11.0,4.0,11.0,8.0,11.0,68.0,26.0,29.0,2.0,3.0
1.0,21.0,1.0,,7.0,,7.0,Fidanzata,1.0,1.0,,Federico II,14.0,Social Service,1.0,,3.0,,,,1.0,0.0,0.0,1.0,,,1.0,0.0,0.0,1.0,,,5.0,2.0,6.0,12.0,5.0,1.0,1.0,1.0,1.0,1.0,0.0,1.0,1.0,0.0,0.0,1.0,1.0,1.0,0.0,3.0,3.0,2.0,3.0,3.0,2.0,2.0,2.0,2.0,3.0,3.0,1.0,3.0,3.0,2.0,2.0,2.0,2.0,2.0,2.0,2.0,2.0,3.0,1.0,1.0,1.0,1.0,2.0,4.0,3.0,2.0,2.0,2.0,2.0,1.0,1.0,1.0,4.0,3.0,1.0,3.0,3.0,2.0,4.0,3.0,2.0,1.0,2.0,2.0,1.0,1.0,3.0,1.0,3.0,3.0,3.0,1.0,3.0,4.0,2.0,3.0,2.0,2.0,1.0,1.0,1.0,5.0,4.0,4.0,2.0,2.0,3.0,7.0,6.0,5.0,4.0,4.0,2.0,3.0,3.0,3.0,65.0,7.0,3.0,13.0,7.0,13.0,13.0,11.0,15.0,9.0,8.0,12.0,8.0,5.0,8.0,6.0,5.0,10.0,11.0,4.0,12.0,10.0,10.0,65.0,29.0,31.0,6.0,4.0
1.0,19.0,1.0,,7.0,,1.0,,1.0,1.0,,Federico II,10.0,,1.0,,3.0,,,,1.0,0.0,1.0,1.0,,,1.0,0.0,1.0,1.0,,,6.0,1.0,5.0,7.0,2.0,2.0,1.0,0.0,2.0,2.0,0.0,0.0,2.0,2.0,1.0,1.0,2.0,2.0,3.0,4.0,3.0,1.0,1.0,4.0,1.0,1.0,3.0,1.0,2.0,1.0,1.0,4.0,1.0,3.0,3.0,2.0,1.0,3.0,3.0,4.0,2.0,1.0,1.0,3.0,1.0,1.0,1.0,4.0,1.0,2.0,3.0,3.0,1.0,1.0,2.0,1.0,4.0,3.0,1.0,3.0,3.0,1.0,4.0,1.0,2.0,2.0,1.0,3.0,1.0,1.0,1.0,1.0,4.0,2.0,2.0,3.0,2.0,4.0,1.0,4.0,3.0,4.0,5.0,5.0,6.0,6.0,6.0,4.0,5.0,5.0,4.0,5.0,5.0,5.0,5.0,5.0,5.0,5.0,5.0,5.0,86.0,11.0,16.0,16.0,14.0,10.0,15.0,20.0,16.0,9.0,6.0,4.0,11.0,6.0,4.0,9.0,4.0,10.0,4.0,4.0,16.0,11.0,11.0,75.0,32.0,14.0,14.0,6.0
1.0,20.0,1.0,,7.0,,1.0,,1.0,1.0,,Federico II,10.0,,1.0,,2.0,,,,1.0,1.0,1.0,1.0,,,1.0,0.0,0.0,1.0,,,6.0,1.0,3.0,5.0,3.0,1.0,3.0,0.0,1.0,1.0,2.0,0.0,1.0,2.0,1.0,1.0,2.0,0.0,1.0,3.0,1.0,4.0,4.0,2.0,3.0,1.0,2.0,3.0,1.0,4.0,1.0,3.0,4.0,3.0,1.0,4.0,1.0,2.0,2.0,4.0,3.0,4.0,1.0,3.0,1.0,3.0,4.0,1.0,3.0,4.0,2.0,3.0,4.0,1.0,2.0,1.0,2.0,3.0,1.0,1.0,3.0,1.0,3.0,3.0,4.0,3.0,1.0,3.0,1.0,1.0,4.0,1.0,4.0,4.0,3.0,1.0,2.0,4.0,1.0,4.0,3.0,3.0,5.0,5.0,5.0,7.0,7.0,6.0,3.0,5.0,6.0,6.0,7.0,3.0,3.0,2.0,3.0,6.0,4.0,5.0,68.0,10.0,15.0,20.0,14.0,13.0,8.0,18.0,10.0,7.0,16.0,14.0,10.0,8.0,4.0,7.0,6.0,8.0,16.0,4.0,14.0,13.0,10.0,65.0,32.0,46.0,8.0,8.0
1.0,81.0,1.0,,7.0,,6.0,,1.0,1.0,,Federico II,10.0,,1.0,,2.0,,,,1.0,1.0,1.0,1.0,,,1.0,0.0,0.0,1.0,,,5.0,1.0,3.0,8.0,4.0,1.0,2.0,0.0,0.0,0.0,0.0,2.0,1.0,0.0,0.0,0.0,0.0,1.0,0.0,2.0,3.0,2.0,3.0,3.0,3.0,1.0,1.0,1.0,3.0,2.0,1.0,2.0,2.0,4.0,1.0,1.0,1.0,1.0,2.0,4.0,3.0,2.0,1.0,2.0,1.0,4.0,2.0,2.0,1.0,2.0,1.0,1.0,2.0,1.0,1.0,2.0,2.0,2.0,1.0,3.0,2.0,1.0,4.0,2.0,2.0,1.0,1.0,1.0,1.0,1.0,2.0,1.0,3.0,3.0,2.0,1.0,2.0,2.0,1.0,3.0,7.0,4.0,7.0,4.0,5.0,2.0,3.0,3.0,2.0,5.0,3.0,6.0,6.0,6.0,6.0,7.0,4.0,4.0,4.0,4.0,99.0,14.0,16.0,8.0,10.0,12.0,19.0,16.0,8.0,7.0,7.0,8.0,8.0,9.0,4.0,5.0,5.0,10.0,8.0,4.0,13.0,10.0,6.0,55.0,30.0,23.0,3.0,4.0
1.0,23.0,1.0,,7.0,,1.0,,1.0,1.0,,Federico II,10.0,,1.0,,3.0,,,,1.0,1.0,1.0,1.0,,,1.0,0.0,0.0,1.0,,,6.0,1.0,6.0,5.0,3.0,1.0,1.0,0.0,0.0,0.0,1.0,1.0,0.0,0.0,1.0,1.0,0.0,1.0,0.0,4.0,2.0,2.0,2.0,3.0,1.0,1.0,3.0,2.0,4.0,1.0,1.0,2.0,1.0,1.0,4.0,2.0,1.0,3.0,2.0,2.0,4.0,2.0,3.0,2.0,1.0,1.0,1.0,2.0,2.0,2.0,3.0,3.0,1.0,1.0,2.0,3.0,2.0,3.0,2.0,4.0,3.0,4.0,3.0,1.0,2.0,1.0,1.0,4.0,2.0,2.0,2.0,1.0,4.0,2.0,3.0,2.0,3.0,4.0,1.0,2.0,4.0,4.0,4.0,3.0,2.0,7.0,7.0,4.0,5.0,5.0,4.0,6.0,6.0,2.0,2.0,2.0,3.0,5.0,6.0,4.0,63.0,10.0,9.0,18.0,14.0,12.0,6.0,18.0,12.0,12.0,7.0,6.0,9.0,6.0,4.0,9.0,10.0,16.0,6.0,4.0,11.0,9.0,12.0,69.0,41.0,19.0,2.0,5.0
1.0,19.0,1.0,,7.0,,1.0,,1.0,1.0,,Federico II,10.0,,1.0,,3.0,,,,1.0,0.0,0.0,1.0,,,1.0,0.0,0.0,1.0,,,6.0,1.0,3.0,8.0,4.0,3.0,3.0,1.0,2.0,2.0,0.0,1.0,1.0,0.0,2.0,2.0,1.0,2.0,0.0,2.0,1.0,4.0,2.0,1.0,1.0,1.0,1.0,2.0,2.0,2.0,1.0,2.0,2.0,3.0,1.0,3.0,1.0,3.0,2.0,1.0,3.0,2.0,4.0,2.0,1.0,1.0,4.0,1.0,2.0,2.0,2.0,3.0,3.0,1.0,1.0,2.0,1.0,2.0,1.0,2.0,2.0,4.0,2.0,1.0,4.0,1.0,1.0,2.0,1.0,3.0,2.0,1.0,1.0,3.0,2.0,1.0,1.0,2.0,1.0,1.0,1.0,1.0,4.0,1.0,2.0,6.0,6.0,6.0,5.0,5.0,6.0,7.0,7.0,4.0,4.0,4.0,2.0,5.0,2.0,5.0,52.0,3.0,7.0,18.0,16.0,14.0,12.0,14.0,6.0,8.0,15.0,7.0,5.0,4.0,4.0,5.0,11.0,9.0,9.0,4.0,6.0,11.0,9.0,46.0,32.0,31.0,11.0,9.0
1.0,19.0,1.0,,7.0,,7.0,Impegnato,1.0,1.0,,Federico II,10.0,,1.0,,3.0,,,,0.0,1.0,1.0,1.0,,,1.0,0.0,0.0,1.0,,,5.0,1.0,5.0,10.0,3.0,1.0,1.0,1.0,0.0,1.0,2.0,0.0,2.0,0.0,0.0,1.0,0.0,2.0,0.0,4.0,3.0,2.0,4.0,2.0,1.0,1.0,3.0,2.0,3.0,4.0,1.0,3.0,3.0,1.0,1.0,1.0,1.0,1.0,3.0,1.0,2.0,4.0,1.0,2.0,1.0,1.0,4.0,3.0,2.0,1.0,2.0,2.0,4.0,1.0,1.0,1.0,2.0,2.0,1.0,2.0,2.0,3.0,3.0,4.0,4.0,1.0,1.0,2.0,2.0,1.0,4.0,1.0,2.0,2.0,2.0,1.0,2.0,3.0,1.0,2.0,3.0,1.0,4.0,1.0,3.0,5.0,5.0,4.0,5.0,4.0,3.0,6.0,6.0,5.0,6.0,4.0,3.0,3.0,4.0,5.0,70.0,6.0,8.0,14.0,12.0,12.0,15.0,15.0,12.0,8.0,11.0,13.0,7.0,4.0,4.0,9.0,5.0,9.0,16.0,4.0,9.0,7.0,7.0,51.0,30.0,40.0,6.0,5.0
1.0,21.0,1.0,,7.0,,8.0,,1.0,1.0,,Federico II,10.0,,1.0,,3.0,,,,1.0,1.0,1.0,1.0,,,1.0,0.0,0.0,1.0,,,6.0,1.0,6.0,10.0,4.0,1.0,2.0,0.0,1.0,1.0,0.0,1.0,0.0,0.0,0.0,1.0,1.0,2.0,0.0,1.0,2.0,3.0,1.0,2.0,1.0,1.0,2.0,2.0,1.0,2.0,2.0,3.0,1.0,2.0,2.0,1.0,1.0,2.0,2.0,3.0,4.0,2.0,2.0,1.0,2.0,1.0,2.0,2.0,1.0,1.0,2.0,3.0,1.0,2.0,2.0,2.0,2.0,1.0,1.0,4.0,2.0,3.0,4.0,1.0,2.0,3.0,1.0,4.0,2.0,1.0,2.0,2.0,3.0,3.0,2.0,1.0,2.0,2.0,1.0,4.0,2.0,1.0,5.0,3.0,6.0,4.0,4.0,3.0,3.0,3.0,3.0,6.0,7.0,4.0,4.0,4.0,2.0,5.0,4.0,5.0,80.0,7.0,14.0,11.0,9.0,13.0,12.0,16.0,7.0,8.0,8.0,4.0,8.0,4.0,4.0,8.0,7.0,13.0,7.0,8.0,13.0,10.0,7.0,58.0,35.0,19.0,6.0,4.0
1.0,19.0,1.0,,7.0,,1.0,,1.0,1.0,,Federico II,10.0,,1.0,,3.0,,,,1.0,0.0,0.0,1.0,,,1.0,0.0,0.0,1.0,,,5.0,1.0,6.0,8.0,3.0,1.0,3.0,0.0,0.0,0.0,2.0,1.0,0.0,0.0,1.0,1.0,0.0,0.0,3.0,4.0,3.0,2.0,3.0,4.0,1.0,1.0,2.0,1.0,2.0,3.0,1.0,4.0,3.0,3.0,2.0,3.0,1.0,4.0,2.0,4.0,2.0,3.0,1.0,4.0,2.0,2.0,2.0,3.0,3.0,4.0,4.0,3.0,3.0,1.0,2.0,1.0,3.0,4.0,2.0,4.0,3.0,1.0,3.0,4.0,3.0,2.0,1.0,4.0,2.0,1.0,3.0,1.0,2.0,2.0,4.0,2.0,4.0,4.0,1.0,4.0,5.0,2.0,7.0,7.0,6.0,5.0,5.0,1.0,3.0,2.0,1.0,4.0,4.0,1.0,2.0,2.0,7.0,7.0,5.0,5.0,99.0,11.0,20.0,11.0,6.0,8.0,5.0,24.0,14.0,10.0,10.0,13.0,14.0,7.0,4.0,8.0,4.0,12.0,12.0,5.0,13.0,11.0,16.0,80.0,34.0,35.0,1.0,11.0
1.0,34.0,2.0,,7.0,,1.0,,1.0,2.0,,Federico II,3.0,,1.0,,1.0,,,,1.0,0.0,0.0,1.0,,,1.0,0.0,0.0,1.0,,,7.0,1.0,8.0,14.0,3.0,1.0,1.0,0.0,1.0,1.0,0.0,0.0,0.0,1.0,0.0,1.0,1.0,2.0,0.0,2.0,4.0,2.0,1.0,3.0,1.0,1.0,2.0,1.0,1.0,1.0,1.0,3.0,3.0,1.0,1.0,2.0,1.0,3.0,3.0,3.0,1.0,1.0,1.0,3.0,1.0,1.0,1.0,3.0,3.0,1.0,2.0,1.0,1.0,1.0,3.0,1.0,3.0,4.0,1.0,1.0,3.0,3.0,3.0,3.0,1.0,1.0,1.0,1.0,2.0,1.0,1.0,1.0,3.0,1.0,2.0,1.0,3.0,3.0,1.0,6.0,4.0,4.0,6.0,3.0,2.0,7.0,7.0,7.0,6.0,6.0,7.0,6.0,6.0,5.0,5.0,5.0,5.0,5.0,4.0,4.0,70.0,14.0,11.0,21.0,19.0,12.0,15.0,18.0,11.0,9.0,6.0,10.0,10.0,4.0,4.0,10.0,4.0,4.0,4.0,4.0,12.0,6.0,11.0,54.0,31.0,20.0,7.0,2.0
1.0,19.0,2.0,,7.0,,7.0,Fidanzato,1.0,1.0,,Federico II,10.0,,1.0,,2.0,,,,1.0,0.0,0.0,1.0,,,1.0,0.0,0.0,1.0,,,4.0,1.0,6.0,7.0,4.0,2.0,0.0,1.0,0.0,0.0,1.0,0.0,1.0,0.0,0.0,1.0,0.0,1.0,0.0,3.0,2.0,2.0,2.0,3.0,2.0,1.0,3.0,1.0,2.0,1.0,1.0,2.0,1.0,3.0,3.0,2.0,1.0,4.0,3.0,2.0,3.0,1.0,1.0,2.0,1.0,1.0,2.0,2.0,2.0,1.0,3.0,3.0,1.0,1.0,3.0,1.0,2.0,3.0,1.0,2.0,3.0,2.0,2.0,2.0,2.0,2.0,1.0,2.0,2.0,1.0,1.0,1.0,2.0,3.0,3.0,1.0,2.0,4.0,1.0,5.0,4.0,4.0,2.0,5.0,5.0,6.0,5.0,5.0,5.0,5.0,4.0,4.0,5.0,4.0,5.0,5.0,1.0,5.0,5.0,5.0,80.0,13.0,12.0,16.0,14.0,9.0,14.0,16.0,11.0,8.0,8.0,7.0,9.0,5.0,4.0,11.0,4.0,9.0,4.0,4.0,8.0,12.0,13.0,62.0,32.0,19.0,4.0,3.0
1.0,19.0,2.0,,7.0,,8.0,,1.0,1.0,,Federico II,10.0,,1.0,,3.0,,,,1.0,1.0,1.0,1.0,1.0,Console,1.0,1.0,0.0,1.0,1.0,Console,4.0,1.0,9.0,20.0,4.0,3.0,0.0,0.0,2.0,2.0,2.0,0.0,2.0,3.0,0.0,2.0,2.0,1.0,0.0,4.0,3.0,4.0,1.0,3.0,1.0,1.0,4.0,2.0,4.0,3.0,1.0,4.0,3.0,2.0,2.0,3.0,1.0,2.0,4.0,3.0,4.0,3.0,1.0,3.0,1.0,1.0,4.0,4.0,2.0,4.0,2.0,3.0,3.0,1.0,4.0,1.0,4.0,2.0,1.0,4.0,4.0,4.0,4.0,4.0,4.0,3.0,1.0,4.0,4.0,1.0,4.0,1.0,4.0,3.0,4.0,1.0,4.0,4.0,1.0,1.0,5.0,1.0,1.0,3.0,7.0,6.0,7.0,5.0,7.0,7.0,6.0,7.0,7.0,5.0,7.0,7.0,1.0,4.0,7.0,6.0,67.0,7.0,11.0,18.0,20.0,14.0,19.0,18.0,16.0,13.0,15.0,10.0,13.0,4.0,4.0,16.0,5.0,16.0,13.0,4.0,15.0,12.0,10.0,82.0,42.0,38.0,15.0,4.0
1.0,19.0,1.0,,7.0,,7.0,Fidanzata,1.0,1.0,,Federico II,10.0,,1.0,,3.0,,,,0.0,1.0,0.0,1.0,,,0.0,1.0,0.0,1.0,,,6.0,1.0,5.0,10.0,3.0,1.0,2.0,0.0,1.0,2.0,1.0,0.0,1.0,1.0,1.0,0.0,1.0,0.0,0.0,4.0,3.0,4.0,2.0,3.0,1.0,1.0,2.0,2.0,2.0,2.0,1.0,3.0,2.0,1.0,2.0,3.0,1.0,3.0,4.0,2.0,1.0,2.0,1.0,3.0,1.0,1.0,4.0,3.0,3.0,2.0,3.0,2.0,2.0,1.0,2.0,1.0,4.0,3.0,1.0,1.0,2.0,2.0,3.0,2.0,3.0,2.0,1.0,2.0,2.0,1.0,2.0,1.0,2.0,2.0,2.0,1.0,3.0,4.0,1.0,2.0,5.0,2.0,2.0,1.0,5.0,7.0,7.0,6.0,5.0,5.0,6.0,7.0,7.0,6.0,6.0,6.0,1.0,2.0,2.0,2.0,56.0,9.0,8.0,20.0,16.0,14.0,18.0,7.0,15.0,9.0,14.0,9.0,11.0,4.0,4.0,10.0,5.0,6.0,8.0,4.0,10.0,7.0,11.0,60.0,32.0,31.0,7.0,4.0
1.0,24.0,1.0,,7.0,,7.0,In una relazione stabile,1.0,1.0,,Federico II,10.0,,1.0,,3.0,,,,1.0,0.0,1.0,1.0,,,1.0,0.0,1.0,1.0,,,3.0,1.0,2.0,6.0,4.0,3.0,2.0,1.0,2.0,3.0,1.0,1.0,2.0,2.0,0.0,2.0,3.0,3.0,0.0,2.0,2.0,4.0,2.0,2.0,2.0,1.0,2.0,3.0,2.0,2.0,1.0,2.0,2.0,2.0,2.0,4.0,1.0,2.0,2.0,2.0,3.0,2.0,3.0,2.0,1.0,2.0,4.0,2.0,2.0,4.0,2.0,2.0,2.0,1.0,2.0,3.0,2.0,2.0,2.0,2.0,2.0,3.0,2.0,2.0,4.0,3.0,1.0,3.0,2.0,3.0,2.0,1.0,2.0,3.0,3.0,2.0,2.0,2.0,1.0,1.0,1.0,1.0,1.0,1.0,1.0,5.0,5.0,5.0,5.0,5.0,5.0,7.0,7.0,2.0,4.0,4.0,2.0,5.0,2.0,5.0,50.0,3.0,3.0,15.0,15.0,14.0,10.0,14.0,8.0,11.0,16.0,8.0,9.0,8.0,4.0,8.0,12.0,10.0,8.0,4.0,8.0,9.0,9.0,53.0,43.0,32.0,18.0,7.0
1.0,19.0,1.0,,7.0,,1.0,,1.0,1.0,,Federico II,10.0,,1.0,,3.0,,,,1.0,1.0,1.0,1.0,,,1.0,0.0,1.0,1.0,,,2.0,1.0,4.0,12.0,4.0,2.0,1.0,0.0,1.0,1.0,2.0,0.0,2.0,0.0,1.0,1.0,1.0,1.0,0.0,4.0,3.0,3.0,3.0,3.0,1.0,1.0,2.0,1.0,3.0,3.0,1.0,3.0,3.0,1.0,3.0,3.0,1.0,2.0,2.0,3.0,3.0,3.0,2.0,3.0,1.0,1.0,3.0,3.0,2.0,3.0,3.0,3.0,3.0,1.0,2.0,1.0,3.0,3.0,1.0,3.0,2.0,2.0,3.0,2.0,3.0,2.0,1.0,3.0,1.0,1.0,3.0,1.0,2.0,2.0,3.0,2.0,3.0,3.0,1.0,5.0,7.0,6.0,4.0,4.0,5.0,7.0,6.0,6.0,3.0,3.0,5.0,6.0,6.0,7.0,6.0,6.0,3.0,4.0,7.0,7.0,93.0,18.0,13.0,19.0,11.0,12.0,19.0,21.0,13.0,11.0,12.0,10.0,11.0,5.0,4.0,7.0,5.0,12.0,12.0,4.0,11.0,8.0,11.0,66.0,32.0,34.0,8.0,5.0
1.0,20.0,2.0,,7.0,,7.0,Impegnato in una relazione,1.0,2.0,,Federico II,10.0,,1.0,,2.0,,,,1.0,0.0,0.0,1.0,,,1.0,0.0,0.0,1.0,,,7.0,1.0,5.0,16.0,2.0,0.0,1.0,1.0,0.0,0.0,0.0,0.0,1.0,1.0,0.0,1.0,0.0,0.0,1.0,4.0,1.0,2.0,1.0,2.0,1.0,1.0,3.0,1.0,4.0,2.0,1.0,2.0,3.0,4.0,4.0,3.0,1.0,1.0,3.0,4.0,4.0,2.0,2.0,3.0,1.0,1.0,2.0,4.0,2.0,2.0,2.0,2.0,2.0,1.0,3.0,2.0,4.0,3.0,1.0,3.0,2.0,1.0,3.0,3.0,2.0,2.0,1.0,3.0,3.0,3.0,2.0,1.0,2.0,3.0,2.0,3.0,3.0,3.0,1.0,2.0,1.0,3.0,3.0,3.0,1.0,6.0,5.0,5.0,6.0,6.0,4.0,7.0,7.0,6.0,6.0,5.0,1.0,1.0,2.0,1.0,53.0,6.0,7.0,16.0,16.0,14.0,17.0,5.0,15.0,8.0,9.0,9.0,10.0,6.0,4.0,12.0,8.0,14.0,8.0,4.0,11.0,11.0,8.0,69.0,38.0,26.0,2.0,4.0
1.0,21.0,1.0,,7.0,,1.0,,1.0,1.0,,Federico II,10.0,,1.0,,2.0,,,,1.0,1.0,1.0,1.0,,,1.0,1.0,0.0,1.0,,,6.0,1.0,4.0,11.0,1.0,2.0,1.0,0.0,1.0,1.0,0.0,2.0,1.0,0.0,1.0,1.0,0.0,1.0,1.0,4.0,3.0,2.0,2.0,4.0,1.0,1.0,1.0,3.0,3.0,2.0,1.0,3.0,3.0,2.0,2.0,4.0,1.0,3.0,2.0,2.0,2.0,3.0,2.0,4.0,1.0,1.0,2.0,1.0,2.0,1.0,3.0,4.0,3.0,1.0,1.0,3.0,3.0,3.0,1.0,2.0,3.0,1.0,3.0,4.0,4.0,2.0,1.0,2.0,1.0,1.0,2.0,1.0,2.0,3.0,4.0,1.0,3.0,2.0,1.0,4.0,2.0,5.0,6.0,5.0,5.0,6.0,6.0,4.0,4.0,4.0,5.0,6.0,7.0,4.0,4.0,4.0,6.0,7.0,6.0,5.0,85.0,11.0,16.0,16.0,13.0,13.0,12.0,24.0,10.0,7.0,12.0,11.0,13.0,4.0,4.0,5.0,9.0,9.0,10.0,4.0,10.0,12.0,13.0,67.0,29.0,33.0,6.0,6.0
1.0,19.0,2.0,,7.0,,1.0,,1.0,1.0,,Federico II,10.0,,1.0,,2.0,,,,1.0,1.0,0.0,1.0,,,0.0,0.0,0.0,1.0,,,3.0,1.0,2.0,4.0,4.0,2.0,1.0,0.0,1.0,2.0,2.0,0.0,2.0,2.0,0.0,1.0,2.0,1.0,0.0,2.0,3.0,3.0,2.0,2.0,4.0,1.0,3.0,2.0,3.0,4.0,2.0,3.0,3.0,1.0,4.0,3.0,1.0,2.0,3.0,3.0,2.0,3.0,2.0,3.0,2.0,2.0,3.0,3.0,2.0,2.0,2.0,2.0,3.0,1.0,3.0,2.0,3.0,2.0,1.0,2.0,2.0,4.0,3.0,3.0,4.0,2.0,1.0,3.0,3.0,3.0,4.0,2.0,3.0,2.0,2.0,2.0,3.0,3.0,1.0,2.0,4.0,4.0,4.0,2.0,5.0,6.0,5.0,2.0,4.0,5.0,2.0,5.0,5.0,4.0,4.0,4.0,3.0,6.0,4.0,5.0,81.0,10.0,11.0,13.0,11.0,10.0,12.0,18.0,11.0,13.0,13.0,10.0,10.0,9.0,4.0,12.0,9.0,10.0,14.0,7.0,12.0,7.0,8.0,58.0,50.0,37.0,12.0,4.0
1.0,23.0,1.0,,7.0,,7.0,Relazione stabile,1.0,2.0,,Federico II,10.0,,1.0,,2.0,,,,1.0,1.0,1.0,1.0,,,0.0,1.0,0.0,1.0,,,5.0,1.0,5.0,7.0,4.0,1.0,1.0,0.0,1.0,1.0,0.0,0.0,1.0,1.0,0.0,0.0,0.0,1.0,1.0,3.0,2.0,4.0,3.0,3.0,1.0,1.0,2.0,2.0,1.0,3.0,1.0,3.0,4.0,1.0,2.0,2.0,1.0,3.0,1.0,3.0,2.0,3.0,2.0,1.0,1.0,1.0,3.0,3.0,3.0,2.0,3.0,2.0,2.0,1.0,1.0,1.0,3.0,3.0,1.0,3.0,2.0,2.0,2.0,3.0,3.0,1.0,1.0,2.0,1.0,1.0,4.0,1.0,2.0,2.0,3.0,1.0,2.0,3.0,1.0,3.0,5.0,4.0,3.0,2.0,4.0,6.0,4.0,4.0,4.0,3.0,5.0,6.0,7.0,4.0,4.0,4.0,2.0,5.0,6.0,5.0,76.0,12.0,9.0,14.0,12.0,13.0,12.0,18.0,12.0,8.0,12.0,13.0,7.0,4.0,4.0,5.0,6.0,8.0,12.0,4.0,10.0,7.0,12.0,56.0,27.0,37.0,6.0,2.0
1.0,23.0,2.0,,7.0,,1.0,,1.0,1.0,,Federico II,10.0,,1.0,,3.0,,,,1.0,1.0,0.0,1.0,,,1.0,1.0,0.0,1.0,,,7.0,1.0,4.0,12.0,3.0,1.0,0.0,0.0,0.0,0.0,0.0,0.0,0.0,0.0,0.0,0.0,0.0,1.0,2.0,4.0,2.0,1.0,1.0,2.0,1.0,1.0,2.0,1.0,3.0,1.0,1.0,3.0,1.0,1.0,3.0,2.0,1.0,2.0,2.0,3.0,3.0,1.0,1.0,2.0,1.0,1.0,1.0,4.0,1.0,1.0,3.0,2.0,1.0,1.0,2.0,1.0,4.0,3.0,1.0,2.0,2.0,3.0,3.0,1.0,1.0,2.0,1.0,3.0,2.0,2.0,1.0,1.0,2.0,2.0,2.0,1.0,2.0,4.0,1.0,2.0,1.0,1.0,1.0,1.0,2.0,7.0,7.0,7.0,7.0,6.0,7.0,7.0,7.0,5.0,3.0,2.0,1.0,3.0,2.0,3.0,36.0,4.0,4.0,21.0,20.0,14.0,10.0,9.0,16.0,9.0,5.0,4.0,8.0,4.0,4.0,8.0,5.0,11.0,4.0,4.0,11.0,7.0,10.0,63.0,30.0,13.0,2.0,2.0
1.0,20.0,2.0,,7.0,,1.0,,1.0,1.0,,Federico II,10.0,,1.0,,3.0,,,,1.0,0.0,1.0,1.0,,,0.0,0.0,0.0,1.0,,,7.0,1.0,2.0,6.0,2.0,2.0,1.0,0.0,2.0,1.0,0.0,1.0,0.0,1.0,0.0,0.0,0.0,1.0,0.0,4.0,2.0,3.0,4.0,3.0,1.0,1.0,1.0,1.0,3.0,4.0,3.0,4.0,4.0,3.0,2.0,3.0,1.0,1.0,1.0,4.0,3.0,4.0,1.0,3.0,3.0,1.0,3.0,4.0,4.0,4.0,4.0,4.0,4.0,2.0,1.0,1.0,4.0,4.0,1.0,3.0,3.0,1.0,4.0,3.0,3.0,3.0,1.0,2.0,1.0,2.0,4.0,2.0,4.0,3.0,3.0,1.0,3.0,4.0,1.0,2.0,2.0,1.0,1.0,1.0,2.0,6.0,5.0,5.0,6.0,6.0,4.0,7.0,7.0,5.0,5.0,2.0,3.0,5.0,4.0,5.0,56.0,5.0,4.0,16.0,16.0,14.0,12.0,17.0,16.0,9.0,12.0,15.0,12.0,4.0,4.0,4.0,5.0,11.0,16.0,10.0,16.0,13.0,12.0,80.0,32.0,43.0,7.0,2.0